Back to Testudos

Report · Failed test case

Testudos
Test report · TR-20261013-122017
Test case 3 of 4

test_buttons_tab_custom_button_click_updates_custom_color_status

FAILED
Module
test_tabs_buttons.py
Started
12:20:12
Duration
2.62 s
Markers
e2e
Requirement
SRS-014

Failure

AssertionError: Custom button color
expected #2f54a2, got #7b8ba3
tests/test_tabs_buttons.py:88 in test_buttons_tab_custom_button_click_updates_custom_color_status
    app.click(custom_button)
>   assert status.color == "#2f54a2", "Custom button color"
E   AssertionError: Custom button color
E   assert '#7b8ba3' == '#2f54a2'

Steps

TimeStepResult
12:20:12.2select_tab("Buttons")OK
12:20:12.7click(customButton)OK
12:20:13.4assert customStatus.text == "Clicked"PASSED
12:20:14.6assert customStatus.color == "#2f54a2"FAILED
Figure 3 — Application state at failure (12:20:14.6)
Generated by Testudos 0.1.0 · 2026-10-13 12:20:17 UTC+02:00 Page 3 of 6